Reaction Details
TargetAlpha-1A adrenergic receptor
LigandBDBM50328488
Substrate/Competitorn/a
Meas. Tech.ChEMBL_665656 (CHEMBL1261587)
Ki 0.2±n/a nM
Citation Kristensen, JLPüschl, AJensen, MRisgaard, RChristoffersen, CTBang-Andersen, BBalle, T Exploring the neuroleptic substituent in octoclothepin: potential ligands for positron emission tomography with subnanomolar affinity fora(1)-adrenoceptors. J Med Chem53:7021-34 (2010) 
 
Alpha-1A adrenergic receptor
Name:Alpha-1A adrenergic receptor
Type:Enzyme Catalytic Domain
Mol. Mass.:51492.08
Organism:CALF
Description:adrenergic Alpha1 0 CALF
Residue:466
BDBM50328488
NameBDBM50328488
Synonyms:5-(11-(4-Methylpiperazin-1-yl)-10,11-dihydrodibenzo[b,f]thiepin-2-yl)pyrimidine | CHEMBL1259042
TypeSmall organic molecule
Emp. Form.C23H24N4S
Mol. Mass.388.528
SMILESCN1CCN(CC1)C1Cc2ccccc2Sc2ccc(cc12)-c1cncnc1