Reaction Details
TargetAlpha-1A adrenergic receptor
LigandBDBM50328500
Substrate/Competitorn/a
Meas. Tech.ChEMBL_665656 (CHEMBL1261587)
Ki 0.088±n/a nM
Citation Kristensen, JLPüschl, AJensen, MRisgaard, RChristoffersen, CTBang-Andersen, BBalle, T Exploring the neuroleptic substituent in octoclothepin: potential ligands for positron emission tomography with subnanomolar affinity fora(1)-adrenoceptors. J Med Chem53:7021-34 (2010) 
 
Alpha-1A adrenergic receptor
Name:Alpha-1A adrenergic receptor
Type:Enzyme Catalytic Domain
Mol. Mass.:51492.08
Organism:CALF
Description:adrenergic Alpha1 0 CALF
Residue:466
BDBM50328500
NameBDBM50328500
Synonyms:CHEMBL1259144 | rac-N-((11-(4-Methylpiperazin-1-yl)-10,11-dihydrodibenzo[b,f]thiepin-2-yl)methyl)acetamide
TypeSmall organic molecule
Emp. Form.C22H27N3OS
Mol. Mass.381.534
SMILESCN1CCN(CC1)C1Cc2ccccc2Sc2ccc(CNC(C)=O)cc12