Reaction Details
TargetAlpha-1B adrenergic receptor
LigandBDBM22872
Substrate/Competitorn/a
Meas. Tech.ChEMBL_665657 (CHEMBL1261588)
Ki 0.56±n/a nM
Citation Kristensen, JLPüschl, AJensen, MRisgaard, RChristoffersen, CTBang-Andersen, BBalle, T Exploring the neuroleptic substituent in octoclothepin: potential ligands for positron emission tomography with subnanomolar affinity fora(1)-adrenoceptors. J Med Chem53:7021-34 (2010) 
 
Alpha-1B adrenergic receptor
Name:Alpha-1B adrenergic receptor
Type:Enzyme Catalytic Domain
Mol. Mass.:56514.13
Organism:C.H.O.
Description:adrenergic Alpha1B ADRA1B C.H.O.::P18841
Residue:515
BDBM22872
NameBDBM22872
Synonyms:1-(3-chloro-5,6-dihydrobenzo[b][1]benzothiepin-5-yl)-4-methyl-piperazine;maleate 1-{6-chloro-2-thiatricyclo[9.4.0.0^{3,8}]pentadeca-1(15),3(8),4,6,11,13-hexaen-9-yl}-4-methylpiperazine CLOROTEPINE (+) Clothepin OCTOCLOTHEPIN,(-) Octoclothepine
TypeSmall organic molecule
Emp. Form.C19H21ClN2S
Mol. Mass.344.901
SMILESCN1CCN(CC1)C1Cc2ccccc2Sc2ccc(Cl)cc12