Reaction Details
TargetAlpha-1B adrenergic receptor
LigandBDBM50328493
Substrate/Competitorn/a
Meas. Tech.ChEMBL_665657 (CHEMBL1261588)
Ki 1.2±n/a nM
Citation Kristensen, JLPüschl, AJensen, MRisgaard, RChristoffersen, CTBang-Andersen, BBalle, T Exploring the neuroleptic substituent in octoclothepin: potential ligands for positron emission tomography with subnanomolar affinity fora(1)-adrenoceptors. J Med Chem53:7021-34 (2010) 
 
Alpha-1B adrenergic receptor
Name:Alpha-1B adrenergic receptor
Type:Enzyme Catalytic Domain
Mol. Mass.:56514.13
Organism:C.H.O.
Description:adrenergic Alpha1B ADRA1B C.H.O.::P18841
Residue:515
BDBM50328493
NameBDBM50328493
Synonyms:1-(8-(2,3-Dimethylphenyl)-10,11-dihydrodibenzo[b,f]thiepin-10-yl)-4-methylpiperazine | CHEMBL1259080
TypeSmall organic molecule
Emp. Form.C27H30N2S
Mol. Mass.414.606
SMILESCN1CCN(CC1)C1Cc2ccccc2Sc2ccc(cc12)-c1cccc(C)c1C