Reaction Details
TargetHistamine H1 receptor
LigandBDBM22872
Substrate/Competitorn/a
Meas. Tech.ChEMBL_665661 (CHEMBL1261592)
Ki 0.19±n/a nM
Citation Kristensen, JLPüschl, AJensen, MRisgaard, RChristoffersen, CTBang-Andersen, BBalle, T Exploring the neuroleptic substituent in octoclothepin: potential ligands for positron emission tomography with subnanomolar affinity fora(1)-adrenoceptors. J Med Chem53:7021-34 (2010) 
 
Histamine H1 receptor
Name:Histamine H1 receptor
Type:G Protein-Coupled Receptor (GPCR)
Mol. Mass.:55808.72
Organism:Homo sapiens (Human)
Description:Cell pellets from SK-N-MC cells transfected with human H1 receptor were used in binding assay.
Residue:487
BDBM22872
NameBDBM22872
Synonyms:1-(3-chloro-5,6-dihydrobenzo[b][1]benzothiepin-5-yl)-4-methyl-piperazine;maleate 1-{6-chloro-2-thiatricyclo[9.4.0.0^{3,8}]pentadeca-1(15),3(8),4,6,11,13-hexaen-9-yl}-4-methylpiperazine CLOROTEPINE (+) Clothepin OCTOCLOTHEPIN,(-) Octoclothepine
TypeSmall organic molecule
Emp. Form.C19H21ClN2S
Mol. Mass.344.901
SMILESCN1CCN(CC1)C1Cc2ccccc2Sc2ccc(Cl)cc12