Reaction Details
TargetAlpha-1D adrenergic receptor
LigandBDBM50007567
Substrate/Competitorn/a
Meas. Tech.ChEMBL_665658 (CHEMBL1261589)
Ki 0.23±n/a nM
Citation Kristensen, JLPüschl, AJensen, MRisgaard, RChristoffersen, CTBang-Andersen, BBalle, T Exploring the neuroleptic substituent in octoclothepin: potential ligands for positron emission tomography with subnanomolar affinity fora(1)-adrenoceptors. J Med Chem53:7021-34 (2010) 
 
Alpha-1D adrenergic receptor
Name:Alpha-1D adrenergic receptor
Type:Protein
Mol. Mass.:59375.97
Organism:Rattus norvegicus (Rat)
Description:P23944
Residue:561
BDBM50007567
NameBDBM50007567
Synonyms:1-(8-Chloro-10,11-dihydro-dibenzo[b,f]thiepin-10-yl)-4-methyl-piperazine OCTOCLOTHEPIN-R
TypeSmall organic molecule
Emp. Form.C19H21ClN2S
Mol. Mass.344.901
SMILESCN1CCN(CC1)[C@@H]1Cc2ccccc2Sc2ccc(Cl)cc12