Reaction Details
TargetSerine/threonine-protein kinase mTOR
LigandBDBM50328599
Substrate/Competitorn/a
Meas. Tech.ChEMBL_665720 (CHEMBL1261689)
IC50 26±n/a nM
Citation Liu, QChang, JWWang, JKang, SAThoreen, CCMarkhard, AHur, WZhang, JSim, TSabatini, DMGray, NS Discovery of 1-(4-(4-propionylpiperazin-1-yl)-3-(trifluoromethyl)phenyl)-9-(quinolin-3-yl)benzo[h][1,6]naphthyridin-2(1H)-one as a highly potent, selective mammalian target of rapamycin (mTOR) inhibitor for the treatment of cancer. J Med Chem53:7146-55 (2010) 
 
Serine/threonine-protein kinase mTOR
Name:Serine/threonine-protein kinase mTOR
Type:Rapamycin target protein
Mol. Mass.:288917.12
Organism:Homo sapiens (Human)
Description:P42345
Residue:2549
BDBM50328599
NameBDBM50328599
Synonyms:1-(4-morpholino-3-(trifluoromethyl)phenyl)-9-(quinolin-3-yl)benzo[h][1,6]naphthyridin-2(1H)-one | CHEMBL1256455
TypeSmall organic molecule
Emp. Form.C32H23F3N4O2
Mol. Mass.552.5458
SMILESFC(F)(F)c1cc(ccc1N1CCOCC1)-n1c2c(ccc1=O)cnc1ccc(cc21)-c1cnc2ccccc2c1