Reaction Details
TargetSerine/threonine-protein kinase mTOR
LigandBDBM50328603
Substrate/Competitorn/a
Meas. Tech.ChEMBL_665720 (CHEMBL1261689)
IC50 6.8±n/a nM
Citation Liu, QChang, JWWang, JKang, SAThoreen, CCMarkhard, AHur, WZhang, JSim, TSabatini, DMGray, NS Discovery of 1-(4-(4-propionylpiperazin-1-yl)-3-(trifluoromethyl)phenyl)-9-(quinolin-3-yl)benzo[h][1,6]naphthyridin-2(1H)-one as a highly potent, selective mammalian target of rapamycin (mTOR) inhibitor for the treatment of cancer. J Med Chem53:7146-55 (2010) 
 
Serine/threonine-protein kinase mTOR
Name:Serine/threonine-protein kinase mTOR
Type:Rapamycin target protein
Mol. Mass.:288917.12
Organism:Homo sapiens (Human)
Description:P42345
Residue:2549
BDBM50328603
NameBDBM50328603
Synonyms:1-(4-(4-(cyclopropanecarbonyl)piperazin-1-yl)-3-(trifluoromethyl)phenyl)-9-(quinolin-3-yl)benzo[h][1,6]naphthyridin-2(1H)-one | CHEMBL1256456
TypeSmall organic molecule
Emp. Form.C36H28F3N5O2
Mol. Mass.619.635
SMILESFC(F)(F)c1cc(ccc1N1CCN(CC1)C(=O)C1CC1)-n1c2c(ccc1=O)cnc1ccc(cc21)-c1cnc2ccccc2c1