Reaction Details
TargetSerine/threonine-protein kinase mTOR
LigandBDBM50328607
Substrate/Competitorn/a
Meas. Tech.ChEMBL_665720 (CHEMBL1261689)
IC50 1.3±n/a nM
Citation Liu, QChang, JWWang, JKang, SAThoreen, CCMarkhard, AHur, WZhang, JSim, TSabatini, DMGray, NS Discovery of 1-(4-(4-propionylpiperazin-1-yl)-3-(trifluoromethyl)phenyl)-9-(quinolin-3-yl)benzo[h][1,6]naphthyridin-2(1H)-one as a highly potent, selective mammalian target of rapamycin (mTOR) inhibitor for the treatment of cancer. J Med Chem53:7146-55 (2010) 
 
Serine/threonine-protein kinase mTOR
Name:Serine/threonine-protein kinase mTOR
Type:Rapamycin target protein
Mol. Mass.:288917.12
Organism:Homo sapiens (Human)
Description:P42345
Residue:2549
BDBM50328607
NameBDBM50328607
Synonyms:1-(4'-(4-methylpiperazine-1-carbonyl)-2-(trifluoromethyl)-[1,1'-biphenyl]-4-yl)-9-(quinolin-3-yl)benzo[h][1,6]naphthyridin-2(1H)-one | CHEMBL1256460
TypeSmall organic molecule
Emp. Form.C40H30F3N5O2
Mol. Mass.669.6937
SMILESCN1CCN(CC1)C(=O)c1ccc(cc1)-c1ccc(cc1C(F)(F)F)-n1c2c(ccc1=O)cnc1ccc(cc21)-c1cnc2ccccc2c1