Reaction Details
TargetSerine/threonine-protein kinase mTOR
LigandBDBM50328616
Substrate/Competitorn/a
Meas. Tech.ChEMBL_665716 (CHEMBL1261685)
IC50 3±n/a nM
Citation Liu, QChang, JWWang, JKang, SAThoreen, CCMarkhard, AHur, WZhang, JSim, TSabatini, DMGray, NS Discovery of 1-(4-(4-propionylpiperazin-1-yl)-3-(trifluoromethyl)phenyl)-9-(quinolin-3-yl)benzo[h][1,6]naphthyridin-2(1H)-one as a highly potent, selective mammalian target of rapamycin (mTOR) inhibitor for the treatment of cancer. J Med Chem53:7146-55 (2010) 
 
Serine/threonine-protein kinase mTOR
Name:Serine/threonine-protein kinase mTOR
Type:Enzyme
Mol. Mass.:288814.44
Organism:Mus musculus (Mouse)
Description:Q9JLN9
Residue:2549
BDBM50328616
NameBDBM50328616
Synonyms:1-(4-(4-Acetylpiperazin-1-yl)-3-(trifluoromethyl)phenyl)-9-(quinolin-3-yl)benzo[h][1,6]naphthyridin-2(1H)-one | CHEMBL1256469
TypeSmall organic molecule
Emp. Form.C34H26F3N5O2
Mol. Mass.593.5977
SMILESCC(=O)N1CCN(CC1)c1ccc(cc1C(F)(F)F)-n1c2c(ccc1=O)cnc1ccc(cc21)-c1cnc2ccccc2c1