Reaction Details
TargetCannabinoid receptor 1
LigandBDBM50328660
Substrate/Competitorn/a
Meas. Tech.ChEMBL_665777 (CHEMBL1259268)
Ki 1.23±n/a nM
Citation Nikas, SPAlapafuja, SOPapanastasiou, IParonis, CAShukla, VGPapahatjis, DPBowman, ALHalikhedkar, AHan, XMakriyannis, A Novel 1',1'-chain substituted hexahydrocannabinols: 9ß-hydroxy-3-(1-hexyl-cyclobut-1-yl)-hexahydrocannabinol (AM2389) a highly potent cannabinoid receptor 1 (CB1) agonist. J Med Chem53:6996-7010 (2010) 
 
Cannabinoid receptor 1
Name:Cannabinoid receptor 1
Type:G Protein-Coupled Receptor (GPCR)
Mol. Mass.:52856.55
Organism:Rattus norvegicus (rat)
Description:P20272
Residue:473
BDBM50328660
NameBDBM50328660
Synonyms:(6aR,10aR)-3-[1-(1,2-cis-Hexen-1-yl)-cyclopent-1-yl]-6,6a,7,8,10,10a-hexahydro-1-hydroxy-6,6-dimethyl-9H-dibenzo[b,d]pyran-9-one | CHEMBL1259243
TypeSmall organic molecule
Emp. Form.C26H36O3
Mol. Mass.396.5622
SMILESCCCC\C=C/C1(CCCC1)c1cc(O)c2[C@@H]3CC(=O)CC[C@H]3C(C)(C)Oc2c1