Reaction Details
TargetClass D beta-lactamase
LigandBDBM50021954
Substrate/Competitorn/a
Meas. Tech.ChEMBL_667505 (CHEMBL1262145)
IC50 12000±n/a nM
Citation Meziane-Cherif, DLambert, TDupêchez, MCourvalin, PGalimand, M Genetic and biochemical characterization of OXA-63, a new class D beta-lactamase from Brachyspira pilosicoli BM4442. Antimicrob Agents Chemother52:1264-8 (2008) 
 
Class D beta-lactamase
Name:Class D beta-lactamase
Synonyms:n/a
Type:PROTEIN
Mol. Mass.:30708.53
Organism:Brachyspira pilosicoli
Description:ChEMBL_667505
Residue:268
BDBM50021954
NameBDBM50021954
TypeSmall organic molecule
Emp. Form.C8H11NO5S
Mol. Mass.233.242
SMILESCC1(C)[C@@H](N2[C@@H](CC2=O)S1(=O)=O)C(O)=O