Reaction Details
TargetHistone deacetylase 7
LigandBDBM50328678
Substrate/Competitorn/a
Meas. Tech.ChEMBL_672865 (CHEMBL1267840)
IC50 2100±n/a nM
Citation Hutt, DMHerman, DRodrigues, APNoel, SPilewski, JMMatteson, JHoch, BKellner, WKelly, JWSchmidt, AThomas, PJMatsumura, YSkach, WRGentzsch, MRiordan, JRSorscher, EJOkiyoneda, TYates, JRLukacs, GLFrizzell, RAManning, GGottesfeld, JMBalch, WE Reduced histone deacetylase 7 activity restores function to misfolded CFTR in cystic fibrosis. Nat Chem Biol6:25-33 (2009) 
 
Histone deacetylase 7
Name:Histone deacetylase 7
Type:Chromatin regulator; hydrolase; repressor
Mol. Mass.:102942.62
Organism:Homo sapiens (Human)
Description:Q8WUI4
Residue:952
BDBM50328678
NameBDBM50328678
Synonyms:6-(1,3-Dioxo-1H,3H-benzo[de]isoquinolin-2-yl)-hexanoic acid hydroxyamide CHEMBL96051 Scriptaid | Scriptaid, 9
TypeSmall organic molecule
Emp. Form.C18H18N2O4
Mol. Mass.326.3465
SMILESONC(=O)CCCCCN1C(=O)c2cccc3cccc(C1=O)c23