Reaction Details
TargetPolyamine deacetylase HDAC10
LigandBDBM50328678
Substrate/Competitorn/a
Meas. Tech.ChEMBL_672863 (CHEMBL1267838)
IC50 300±n/a nM
Citation Hutt, DMHerman, DRodrigues, APNoel, SPilewski, JMMatteson, JHoch, BKellner, WKelly, JWSchmidt, AThomas, PJMatsumura, YSkach, WRGentzsch, MRiordan, JRSorscher, EJOkiyoneda, TYates, JRLukacs, GLFrizzell, RAManning, GGottesfeld, JMBalch, WE Reduced histone deacetylase 7 activity restores function to misfolded CFTR in cystic fibrosis. Nat Chem Biol6:25-33 (2009) 
 
Polyamine deacetylase HDAC10
Name:Polyamine deacetylase HDAC10
Type:Chromatin regulator; hydrolase; repressor
Mol. Mass.:71431.89
Organism:Homo sapiens (Human)
Description:Q969S8
Residue:669
BDBM50328678
NameBDBM50328678
Synonyms:6-(1,3-Dioxo-1H,3H-benzo[de]isoquinolin-2-yl)-hexanoic acid hydroxyamide CHEMBL96051 Scriptaid | Scriptaid, 9
TypeSmall organic molecule
Emp. Form.C18H18N2O4
Mol. Mass.326.3465
SMILESONC(=O)CCCCCN1C(=O)c2cccc3cccc(C1=O)c23