Reaction Details
TargetProtein arginine N-methyltransferase 1 [11-371]
LigandBDBM50206427
Substrate/Competitorn/a
Meas. Tech.ChEMBL_675343 (CHEMBL1273380)
IC50 375600±n/a nM
Citation Feng, YLi, MWang, BZheng, YG Discovery and mechanistic study of a class of protein arginine methylation inhibitors. J Med Chem53:6028-39 (2010) 
 
Protein arginine N-methyltransferase 1 [11-371]
Name:Protein arginine N-methyltransferase 1 [11-371]
Type:Protein
Mol. Mass.:41506.52
Organism:Homo sapiens (Human)
Description:Q99873[11-371]
Residue:361
BDBM50206427
NameBDBM50206427
Synonyms:7,7'-carbonylbis(azanediyl)bis(4-hydroxynaphthalene-2-sulfonic acid) CHEMBL221047
TypeSmall organic molecule
Emp. Form.C21H16N2O9S2
Mol. Mass.504.49
SMILESOc1cc(cc2cc(NC(=O)Nc3ccc4c(O)cc(cc4c3)S(O)(=O)=O)ccc12)S(O)(=O)=O