Reaction Details
TargetProtein arginine N-methyltransferase 1 [11-371]
LigandBDBM50328753
Substrate/Competitorn/a
Meas. Tech.ChEMBL_675342 (CHEMBL1273379)
IC50 325000±n/a nM
Citation Feng, YLi, MWang, BZheng, YG Discovery and mechanistic study of a class of protein arginine methylation inhibitors. J Med Chem53:6028-39 (2010) 
 
Protein arginine N-methyltransferase 1 [11-371]
Name:Protein arginine N-methyltransferase 1 [11-371]
Type:Protein
Mol. Mass.:41506.52
Organism:Homo sapiens (Human)
Description:Q99873[11-371]
Residue:361
BDBM50328753
NameBDBM50328753
Synonyms:5-amino-4-hydroxy-3-((4-sulfonatophenyl)diazenyl)naphthalene-2,7-disulfonate | CHEMBL1269836
TypeSmall organic molecule
Emp. Form.C16H13N3O10S3
Mol. Mass.503.484
SMILESNc1cc(cc2cc(c(N=Nc3ccc(cc3)S(O)(=O)=O)c(O)c12)S(O)(=O)=O)S(O)(=O)=O