Reaction Details
TargetProtein arginine N-methyltransferase 1 [11-371]
LigandBDBM50000029
Substrate/Competitorn/a
Meas. Tech.ChEMBL_675342 (CHEMBL1273379)
IC50 5330±n/a nM
Citation Feng, YLi, MWang, BZheng, YG Discovery and mechanistic study of a class of protein arginine methylation inhibitors. J Med Chem53:6028-39 (2010) 
 
Protein arginine N-methyltransferase 1 [11-371]
Name:Protein arginine N-methyltransferase 1 [11-371]
Type:Protein
Mol. Mass.:41506.52
Organism:Homo sapiens (Human)
Description:Q99873[11-371]
Residue:361
BDBM50000029
NameBDBM50000029
Synonyms:4-Methyl-8-{4-methyl-3-[3-(3-{3-[2-methyl-5-(4,6,8-trisulfo-naphthalen-1-ylcarbamoyl)-phenylcarbamoyl]-phenyl}-ureido)-benzoylamino]-benzoylamino}-naphthalene-1,3,5-trisulfonic acid; hexa-kis Sodium salt CHEMBL265502 Suramin sodium suramin Na
TypeSmall organic molecule
Emp. Form.C51H34N6O23S6
Mol. Mass.1291.235
SMILESCc1ccc(cc1NC(=O)c1cccc(NC(=O)Nc2cccc(c2)C(=O)Nc2cc(ccc2C)C(=O)Nc2ccc(c3cc(cc(c23)S([O-])(=O)=O)S([O-])(=O)=O)S([O-])(=O)=O)c1)C(=O)Nc1ccc(c2cc(cc(c12)S([O-])(=O)=O)S([O-])(=O)=O)S([O-])(=O)=O