Reaction Details
TargetMitogen-activated protein kinase 14
LigandBDBM50328774
Substrate/Competitorn/a
Meas. Tech.ChEMBL_673595 (CHEMBL1274708)
IC50 5±n/a nM
Citation Ahn, YMClare, MEnsinger, CLHood, MMLord, JWLu, WPMiller, DFPatt, WCSmith, BDVogeti, LKaufman, MDPetillo, PAWise, SCAbendroth, JChun, LClark, RFeese, MKim, HStewart, LFlynn, DL Switch control pocket inhibitors of p38-MAP kinase. Durable type II inhibitors that do not require binding into the canonical ATP hinge region. Bioorg Med Chem Lett20:5793-8 (2010) 
 
Mitogen-activated protein kinase 14
Name:Mitogen-activated protein kinase 14
Type:Serine/threonine-protein kinase
Mol. Mass.:41286.76
Organism:Homo sapiens (Human)
Description:Q16539
Residue:360
BDBM50328774
NameBDBM50328774
Synonyms:2-(3-(3-cyclopentyl-5-(3-(2,3-dichlorophenyl)ureido)-1H-pyrazol-1-yl)phenyl)acetamide | CHEMBL1269947
TypeSmall organic molecule
Emp. Form.C23H23Cl2N5O2
Mol. Mass.472.367
SMILESNC(=O)Cc1cccc(c1)-n1nc(cc1NC(=O)Nc1cccc(Cl)c1Cl)C1CCCC1