Reaction Details
TargetEphrin type-B receptor 2
LigandBDBM50328755
Substrate/Competitorn/a
Meas. Tech.ChEMBL_673602 (CHEMBL1274779)
IC50 82±n/a nM
Citation Ahn, YMClare, MEnsinger, CLHood, MMLord, JWLu, WPMiller, DFPatt, WCSmith, BDVogeti, LKaufman, MDPetillo, PAWise, SCAbendroth, JChun, LClark, RFeese, MKim, HStewart, LFlynn, DL Switch control pocket inhibitors of p38-MAP kinase. Durable type II inhibitors that do not require binding into the canonical ATP hinge region. Bioorg Med Chem Lett20:5793-8 (2010) 
 
Ephrin type-B receptor 2
Name:Ephrin type-B receptor 2
Type:PROTEIN
Mol. Mass.:117491.44
Organism:Homo sapiens (Human)
Description:ChEMBL_1476221
Residue:1055
BDBM50328755
NameBDBM50328755
Synonyms:2-(3-(3-tert-butyl-5-(3-(2,3-dichlorophenyl)ureido)-1H-pyrazol-1-yl)phenyl)acetamide | CHEMBL1271376
TypeSmall organic molecule
Emp. Form.C22H23Cl2N5O2
Mol. Mass.460.356
SMILESCC(C)(C)c1cc(NC(=O)Nc2cccc(Cl)c2Cl)n(n1)-c1cccc(CC(N)=O)c1