Reaction Details
TargetHistamine H3 receptor
LigandBDBM50328801
Substrate/Competitorn/a
Meas. Tech.ChEMBL_673777 (CHEMBL1274954)
IC50 11±n/a nM
Citation Anderson, JTCampbell, MWang, JBrunden, KRHarrington, JJStricker-Krongrad, ASong, JDoucette, CMurphy, SBennani, YL Investigation of 4-piperidinols as novel H3 antagonists. Bioorg Med Chem Lett20:6246-9 (2010) 
 
Histamine H3 receptor
Name:Histamine H3 receptor
Type:G Protein-Coupled Receptor (GPCR)
Mol. Mass.:48691.47
Organism:Homo sapiens (Human)
Description:Binding assays were using CHO cells stably expressing hH3R receptors.
Residue:445
BDBM50328801
NameBDBM50328801
Synonyms:1,2,5-trimethyl-4-(naphthalen-1-ylethynyl)piperidin-4-ol | CHEMBL1269843
TypeSmall organic molecule
Emp. Form.C20H23NO
Mol. Mass.293.4027
SMILESCC1CC(O)(C#Cc2cccc3ccccc23)C(C)CN1C