Reaction Details
TargetHistamine H3 receptor
LigandBDBM50328807
Substrate/Competitorn/a
Meas. Tech.ChEMBL_673777 (CHEMBL1274954)
IC50 2±n/a nM
Citation Anderson, JTCampbell, MWang, JBrunden, KRHarrington, JJStricker-Krongrad, ASong, JDoucette, CMurphy, SBennani, YL Investigation of 4-piperidinols as novel H3 antagonists. Bioorg Med Chem Lett20:6246-9 (2010) 
 
Histamine H3 receptor
Name:Histamine H3 receptor
Type:G Protein-Coupled Receptor (GPCR)
Mol. Mass.:48691.47
Organism:Homo sapiens (Human)
Description:Binding assays were using CHO cells stably expressing hH3R receptors.
Residue:445
BDBM50328807
NameBDBM50328807
Synonyms:(2R,4S,5S)-1,2,5-trimethyl-4-(2-(naphthalen-1-yl)ethyl)piperidin-4-ol | CHEMBL1270059
TypeSmall organic molecule
Emp. Form.C20H27NO
Mol. Mass.297.4345
SMILESC[C@@H]1C[C@@](O)(CCc2cccc3ccccc23)[C@@H](C)CN1C