Reaction Details
TargetCarbonic anhydrase 13
LigandBDBM24514
Substrate/Competitorn/a
Meas. Tech.ChEMBL_673817 (CHEMBL1274994)
IC50 1050±n/a nM
Citation Innocenti, ASupuran, CT Paraoxon, 4-nitrophenyl phosphate and acetate are substrates ofa- but not ofß-,¿- and¿-carbonic anhydrases. Bioorg Med Chem Lett20:6208-12 (2010) 
 
Carbonic anhydrase 13
Name:Carbonic anhydrase 13
Type:Enzyme
Mol. Mass.:29522.80
Organism:Mus musculus (mouse)
Description:Murine cloned isozyme
Residue:262
BDBM24514
NameBDBM24514
Synonyms:4-nitrophenoxyphosphonic acid CHEMBL24231 | p-nitrophenyl phosphate
TypeSmall organic molecule
Emp. Form.C6H6NO6P
Mol. Mass.219.0887
SMILESOP(O)(=O)Oc1ccc(cc1)[N+]([O-])=O