Reaction Details
TargetRenin
LigandBDBM50328846
Substrate/Competitorn/a
Meas. Tech.ChEMBL_673944 (CHEMBL1275121)
IC50 0.05±n/a nM
Citation Corminboeuf, OBezençon, OGrisostomi, CRemen, LRichard-Bildstein, SBur, DPrade, LHess, PStrickner, PFischli, WSteiner, BTreiber, A Design and optimization of new piperidines as renin inhibitors. Bioorg Med Chem Lett20:6286-90 (2010) 
 
Renin
Name:Renin
Type:Enzyme
Mol. Mass.:45058.99
Organism:Homo sapiens (Human)
Description:n/a
Residue:406
BDBM50328846
NameBDBM50328846
Synonyms:(3R,4S)-N-(2-chloro-5-(2-(2,2-difluoroethylamino)ethyl)benzyl)-N-cyclopropyl-4-(4-(2-(2,6-dichloro-4-methylphenoxy)ethoxy)phenyl)piperidine-3-carboxamide | CHEMBL1269678
TypeSmall organic molecule
Emp. Form.C35H40Cl3F2N3O3
Mol. Mass.695.066
SMILESCc1cc(Cl)c(OCCOc2ccc(cc2)[C@H]2CCNC[C@@H]2C(=O)N(Cc2cc(CCNCC(F)F)ccc2Cl)C2CC2)c(Cl)c1