Reaction Details
TargetCytochrome P450 3A4
LigandBDBM50328861
Substrate/Competitorn/a
Meas. Tech.ChEMBL_673952 (CHEMBL1275129)
IC50 3500±n/a nM
Citation Corminboeuf, OBezençon, OGrisostomi, CRemen, LRichard-Bildstein, SBur, DPrade, LHess, PStrickner, PFischli, WSteiner, BTreiber, A Design and optimization of new piperidines as renin inhibitors. Bioorg Med Chem Lett20:6286-90 (2010) 
 
Cytochrome P450 3A4
Name:Cytochrome P450 3A4
Type:Enzyme
Mol. Mass.:57349.57
Organism:Homo sapiens (Human)
Description:n/a
Residue:503
BDBM50328861
NameBDBM50328861
Synonyms:CHEMBL1269696 | methyl 4-chloro-3-(((3R,4S)-N-cyclopropyl-4-(4-(2-(2,6-dichloro-4-methylphenoxy)ethoxy)phenyl)piperidine-3-carboxamido)methyl)benzylcarbamate
TypeSmall organic molecule
Emp. Form.C34H38Cl3N3O5
Mol. Mass.675.042
SMILESCOC(=O)NCc1ccc(Cl)c(CN(C2CC2)C(=O)[C@H]2CNCC[C@@H]2c2ccc(OCCOc3c(Cl)cc(C)cc3Cl)cc2)c1