Reaction Details
TargetCytochrome P450 3A4
LigandBDBM50328844
Substrate/Competitorn/a
Meas. Tech.ChEMBL_673953 (CHEMBL1275130)
IC50 9900±n/a nM
Citation Corminboeuf, OBezençon, OGrisostomi, CRemen, LRichard-Bildstein, SBur, DPrade, LHess, PStrickner, PFischli, WSteiner, BTreiber, A Design and optimization of new piperidines as renin inhibitors. Bioorg Med Chem Lett20:6286-90 (2010) 
 
Cytochrome P450 3A4
Name:Cytochrome P450 3A4
Type:Enzyme
Mol. Mass.:57349.57
Organism:Homo sapiens (Human)
Description:n/a
Residue:503
BDBM50328844
NameBDBM50328844
Synonyms:(3R,4S)-N-(2-chloro-5-((2-fluoroethylamino)methyl)benzyl)-N-cyclopropyl-4-(4-(2-(2,6-dichloro-4-methylphenoxy)ethoxy)phenyl)piperidine-3-carboxamide | CHEMBL1269680
TypeSmall organic molecule
Emp. Form.C34H39Cl3FN3O3
Mol. Mass.663.049
SMILESCc1cc(Cl)c(OCCOc2ccc(cc2)[C@H]2CCNC[C@@H]2C(=O)N(Cc2cc(CNCCF)ccc2Cl)C2CC2)c(Cl)c1