Reaction Details
TargetRenin
LigandBDBM50328868
Substrate/Competitorn/a
Meas. Tech.ChEMBL_673945 (CHEMBL1275122)
IC50 7.30±n/a nM
Citation Corminboeuf, OBezençon, OGrisostomi, CRemen, LRichard-Bildstein, SBur, DPrade, LHess, PStrickner, PFischli, WSteiner, BTreiber, A Design and optimization of new piperidines as renin inhibitors. Bioorg Med Chem Lett20:6286-90 (2010) 
 
Renin
Name:Renin
Type:Enzyme
Mol. Mass.:45058.99
Organism:Homo sapiens (Human)
Description:n/a
Residue:406
BDBM50328868
NameBDBM50328868
Synonyms:4-chloro-3-(((3R,4S)-N-cyclopropyl-4-(4-(2-(2,6-dichloro-4-methylphenoxy)ethoxy)phenyl)piperidine-3-carboxamido)methyl)phenethyl methylcarbamate | CHEMBL1269695
TypeSmall organic molecule
Emp. Form.C35H40Cl3N3O5
Mol. Mass.689.068
SMILESCNC(=O)OCCc1ccc(Cl)c(CN(C2CC2)C(=O)[C@H]2CNCC[C@@H]2c2ccc(OCCOc3c(Cl)cc(C)cc3Cl)cc2)c1