Reaction Details
TargetPotassium voltage-gated channel subfamily H member 2
LigandBDBM50328896
Substrate/Competitorn/a
Meas. Tech.ChEMBL_673956 (CHEMBL1275133)
Ki 2510±n/a nM
Citation Rankovic, ZCai, JKerr, JFradera, XRobinson, JMistry, AFinlay, WMcGarry, GAndrews, FCaulfield, WCumming, IDempster, MWaller, JArbuckle, WAnderson, MMartin, IMitchell, ALong, CBaugh, MWestwood, PKinghorn, EJones, PUitdehaag, JCvan Zeeland, MPotin, DSaniere, LFouquet, AChevallier, FDeronzier, HDorleans, CNicolai, E Optimisation of 2-cyano-pyrimidine inhibitors of cathepsin K: improving selectivity over hERG. Bioorg Med Chem Lett20:6237-41 (2010) 
 
Potassium voltage-gated channel subfamily H member 2
Name:Potassium voltage-gated channel subfamily H member 2
Type:Multi-pass membrane protein
Mol. Mass.:126672.65
Organism:Homo sapiens (Human)
Description:Q12809
Residue:1159
BDBM50328896
NameBDBM50328896
Synonyms:1-(3-(2-cyano-6-(3-(trifluoromethyl)phenyl)pyrimidin-4-yl)propylamino)cyclobutanecarboxamide | CHEMBL1270367
TypeSmall organic molecule
Emp. Form.C20H20F3N5O
Mol. Mass.403.4009
SMILESNC(=O)C1(CCC1)NCCCc1cc(nc(n1)C#N)-c1cccc(c1)C(F)(F)F