Reaction Details
TargetRenin
LigandBDBM50328853
Substrate/Competitorn/a
Meas. Tech.ChEMBL_673988 (CHEMBL1275165)
IC50 0.33±n/a nM
Citation Corminboeuf, OBezençon, ORemen, LGrisostomi, CRichard-Bildstein, SBur, DPrade, LStrickner, PHess, PFischli, WSteiner, BTreiber, A Piperidine-based renin inhibitors: upper chain optimization. Bioorg Med Chem Lett20:6291-6 (2010) 
 
Renin
Name:Renin
Type:Enzyme
Mol. Mass.:45058.99
Organism:Homo sapiens (Human)
Description:n/a
Residue:406
BDBM50328853
NameBDBM50328853
Synonyms:(3R,4S)-N-(2-chloro-5-(3-methoxypropyl)benzyl)-N-cyclopropyl-4-(4-(2-(2,6-dichloro-4-methylphenoxy)ethoxy)phenyl)piperidine-3-carboxamide | CHEMBL1269671
TypeSmall organic molecule
Emp. Form.C35H41Cl3N2O4
Mol. Mass.660.07
SMILESCOCCCc1ccc(Cl)c(CN(C2CC2)C(=O)[C@H]2CNCC[C@@H]2c2ccc(OCCOc3c(Cl)cc(C)cc3Cl)cc2)c1