Reaction Details
TargetRenin
LigandBDBM50328907
Substrate/Competitorn/a
Meas. Tech.ChEMBL_673988 (CHEMBL1275165)
IC50 0.17±n/a nM
Citation Corminboeuf, OBezençon, ORemen, LGrisostomi, CRichard-Bildstein, SBur, DPrade, LStrickner, PHess, PFischli, WSteiner, BTreiber, A Piperidine-based renin inhibitors: upper chain optimization. Bioorg Med Chem Lett20:6291-6 (2010) 
 
Renin
Name:Renin
Type:Enzyme
Mol. Mass.:45058.99
Organism:Homo sapiens (Human)
Description:n/a
Residue:406
BDBM50328907
NameBDBM50328907
Synonyms:(3R,4S)-N-(2-chloro-5-((3,3,3-trifluoropropanamido)methyl)benzyl)-N-cyclopropyl-4-(6-(2-(2,6-dichloro-4-methylphenoxy)ethoxy)pyridin-3-yl)piperidine-3-carboxamide | CHEMBL1269745
TypeSmall organic molecule
Emp. Form.C34H36Cl3F3N4O4
Mol. Mass.728.028
SMILESCc1cc(Cl)c(OCCOc2ccc(cn2)[C@H]2CCNC[C@@H]2C(=O)N(Cc2cc(CNC(=O)CC(F)(F)F)ccc2Cl)C2CC2)c(Cl)c1