Reaction Details
TargetRenin
LigandBDBM50328914
Substrate/Competitorn/a
Meas. Tech.ChEMBL_673988 (CHEMBL1275165)
IC50 0.17±n/a nM
Citation Corminboeuf, OBezençon, ORemen, LGrisostomi, CRichard-Bildstein, SBur, DPrade, LStrickner, PHess, PFischli, WSteiner, BTreiber, A Piperidine-based renin inhibitors: upper chain optimization. Bioorg Med Chem Lett20:6291-6 (2010) 
 
Renin
Name:Renin
Type:Enzyme
Mol. Mass.:45058.99
Organism:Homo sapiens (Human)
Description:n/a
Residue:406
BDBM50328914
NameBDBM50328914
Synonyms:(3R,4S)-N-((5-chloro-2-(3-methoxypropyl)pyridin-4-yl)methyl)-4-(4-((3-(2-chloro-3,6-difluorophenyl)isoxazol-5-yl)methoxy)phenyl)-N-cyclopropylpiperidine-3-carboxamide | CHEMBL1269752
TypeSmall organic molecule
Emp. Form.C35H36Cl2F2N4O4
Mol. Mass.685.588
SMILESCOCCCc1cc(CN(C2CC2)C(=O)[C@H]2CNCC[C@@H]2c2ccc(OCc3cc(no3)-c3c(F)ccc(F)c3Cl)cc2)c(Cl)cn1