Reaction Details
TargetRenin
LigandBDBM50328915
Substrate/Competitorn/a
Meas. Tech.ChEMBL_673988 (CHEMBL1275165)
IC50 0.12±n/a nM
Citation Corminboeuf, OBezençon, ORemen, LGrisostomi, CRichard-Bildstein, SBur, DPrade, LStrickner, PHess, PFischli, WSteiner, BTreiber, A Piperidine-based renin inhibitors: upper chain optimization. Bioorg Med Chem Lett20:6291-6 (2010) 
 
Renin
Name:Renin
Type:Enzyme
Mol. Mass.:45058.99
Organism:Homo sapiens (Human)
Description:n/a
Residue:406
BDBM50328915
NameBDBM50328915
Synonyms:5-chloro-4-(((3R,4S)-4-(4-((3-(2-chloro-3,6-difluorophenyl)isoxazol-5-yl)methoxy)phenyl)-N-cyclopropylpiperidine-3-carboxamido)methyl)-2-(3-methoxypropyl)pyridine 1-oxide | CHEMBL1269753
TypeSmall organic molecule
Emp. Form.C35H36Cl2F2N4O5
Mol. Mass.701.587
SMILESCOCCCc1cc(CN(C2CC2)C(=O)C2CNCCC2c2ccc(OCc3cc([n-][o+]3)-c3c(F)ccc(F)c3Cl)cc2)c(Cl)c[n+]1[O-]