Reaction Details
TargetRenin
LigandBDBM50328906
Substrate/Competitorn/a
Meas. Tech.ChEMBL_673989 (CHEMBL1275166)
IC50 0.9±n/a nM
Citation Corminboeuf, OBezençon, ORemen, LGrisostomi, CRichard-Bildstein, SBur, DPrade, LStrickner, PHess, PFischli, WSteiner, BTreiber, A Piperidine-based renin inhibitors: upper chain optimization. Bioorg Med Chem Lett20:6291-6 (2010) 
 
Renin
Name:Renin
Type:Enzyme
Mol. Mass.:45058.99
Organism:Homo sapiens (Human)
Description:n/a
Residue:406
BDBM50328906
NameBDBM50328906
Synonyms:(3R,4S)-N-(5-(2-acetamidoethyl)-2-chlorobenzyl)-N-cyclopropyl-4-(6-(2-(2,6-dichloro-4-methylphenoxy)ethoxy)pyridin-3-yl)piperidine-3-carboxamide | CHEMBL1269744
TypeSmall organic molecule
Emp. Form.C34H39Cl3N4O4
Mol. Mass.674.057
SMILESCC(=O)NCCc1ccc(Cl)c(CN(C2CC2)C(=O)[C@H]2CNCC[C@@H]2c2ccc(OCCOc3c(Cl)cc(C)cc3Cl)nc2)c1