Reaction Details
TargetRenin
LigandBDBM50328911
Substrate/Competitorn/a
Meas. Tech.ChEMBL_673989 (CHEMBL1275166)
IC50 0.5±n/a nM
Citation Corminboeuf, OBezençon, ORemen, LGrisostomi, CRichard-Bildstein, SBur, DPrade, LStrickner, PHess, PFischli, WSteiner, BTreiber, A Piperidine-based renin inhibitors: upper chain optimization. Bioorg Med Chem Lett20:6291-6 (2010) 
 
Renin
Name:Renin
Type:Enzyme
Mol. Mass.:45058.99
Organism:Homo sapiens (Human)
Description:n/a
Residue:406
BDBM50328911
NameBDBM50328911
Synonyms:(3R,4S)-N-(5-(2-acetamidoethyl)-2-chlorobenzyl)-4-(4-((3-(2-chloro-3,6-difluorophenyl)isoxazol-5-yl)methoxy)phenyl)-N-cyclopropylpiperidine-3-carboxamide | CHEMBL1269749
TypeSmall organic molecule
Emp. Form.C36H36Cl2F2N4O4
Mol. Mass.697.598
SMILESCC(=O)NCCc1ccc(Cl)c(CN(C2CC2)C(=O)[C@H]2CNCC[C@@H]2c2ccc(OCc3cc(no3)-c3c(F)ccc(F)c3Cl)cc2)c1