Reaction Details
TargetRenin
LigandBDBM50328865
Substrate/Competitorn/a
Meas. Tech.ChEMBL_673989 (CHEMBL1275166)
IC50 5.6±n/a nM
Citation Corminboeuf, OBezençon, ORemen, LGrisostomi, CRichard-Bildstein, SBur, DPrade, LStrickner, PHess, PFischli, WSteiner, BTreiber, A Piperidine-based renin inhibitors: upper chain optimization. Bioorg Med Chem Lett20:6291-6 (2010) 
 
Renin
Name:Renin
Type:Enzyme
Mol. Mass.:45058.99
Organism:Homo sapiens (Human)
Description:n/a
Residue:406
BDBM50328865
NameBDBM50328865
Synonyms:(3S,4R)-N-(2-chloro-5-(2-methoxyethyl)benzyl)-N-cyclopropyl-4-(4-(2-(2,6-dichloro-4-methylphenoxy)ethoxy)phenyl)-4-hydroxypiperidine-3-carboxamide | CHEMBL1269699
TypeSmall organic molecule
Emp. Form.C34H39Cl3N2O5
Mol. Mass.662.043
SMILESCOCCc1ccc(Cl)c(CN(C2CC2)C(=O)[C@H]2CNCC[C@]2(O)c2ccc(OCCOc3c(Cl)cc(C)cc3Cl)cc2)c1