Reaction Details
TargetRenin
LigandBDBM50328926
Substrate/Competitorn/a
Meas. Tech.ChEMBL_673988 (CHEMBL1275165)
IC50 0.15±n/a nM
Citation Corminboeuf, OBezençon, ORemen, LGrisostomi, CRichard-Bildstein, SBur, DPrade, LStrickner, PHess, PFischli, WSteiner, BTreiber, A Piperidine-based renin inhibitors: upper chain optimization. Bioorg Med Chem Lett20:6291-6 (2010) 
 
Renin
Name:Renin
Type:Enzyme
Mol. Mass.:45058.99
Organism:Homo sapiens (Human)
Description:n/a
Residue:406
BDBM50328926
NameBDBM50328926
Synonyms:(3S,4R)-N-(2-chloro-5-(2-methoxyethyl)benzyl)-N-cyclopropyl-4-(6-((R)-3-(2,6-dichloro-4-methylphenoxy)pyrrolidin-1-yl)pyridin-3-yl)-4-hydroxypiperidine-3-carboxamide | CHEMBL1269763
TypeSmall organic molecule
Emp. Form.C35H41Cl3N4O4
Mol. Mass.688.083
SMILESCOCCc1ccc(Cl)c(CN(C2CC2)C(=O)[C@H]2CNCC[C@]2(O)c2ccc(nc2)N2CC[C@H](C2)Oc2c(Cl)cc(C)cc2Cl)c1