Reaction Details
TargetCannabinoid receptor 1
LigandBDBM50328969
Substrate/Competitorn/a
Meas. Tech.ChEMBL_674011 (CHEMBL1275188)
EC50 7243±n/a nM
Citation Zhang, YGilliam, AMaitra, RDamaj, MITajuba, JMSeltzman, HHThomas, BF Synthesis and biological evaluation of bivalent ligands for the cannabinoid 1 receptor. J Med Chem53:7048-60 (2010) 
 
Cannabinoid receptor 1
Name:Cannabinoid receptor 1
Type:G Protein-Coupled Receptor (GPCR)
Mol. Mass.:52856.55
Organism:Rattus norvegicus (rat)
Description:P20272
Residue:473
BDBM50328969
NameBDBM50328969
Synonyms:CHEMBL1270270 | N-{2-[(2-Aminoethyl)amino]ethyl}-5-(4-chlorophenyl)-1-(2,4-dichlorophenyl)-4-methyl-1H-pyrazole-3-carboxamide
TypeSmall organic molecule
Emp. Form.C21H22Cl3N5O
Mol. Mass.466.791
SMILESCc1c(nn(c1-c1ccc(Cl)cc1)-c1ccc(Cl)cc1Cl)C(=O)NCCNCCN