Reaction Details
TargetCannabinoid receptor 1
LigandBDBM50328956
Substrate/Competitorn/a
Meas. Tech.ChEMBL_674008 (CHEMBL1275185)
Ki 2.3±n/a nM
Citation Zhang, YGilliam, AMaitra, RDamaj, MITajuba, JMSeltzman, HHThomas, BF Synthesis and biological evaluation of bivalent ligands for the cannabinoid 1 receptor. J Med Chem53:7048-60 (2010) 
 
Cannabinoid receptor 1
Name:Cannabinoid receptor 1
Type:G Protein-Coupled Receptor (GPCR)
Mol. Mass.:52868.96
Organism:Homo sapiens (Human)
Description:P21554
Residue:472
BDBM50328956
NameBDBM50328956
Synonyms:CHEMBL1269774 | N-{11-[(11-Aminoundecyl)amino]undecyl}-5-(4-chlorophenyl)-1-(2,4-dichlorophenyl)-4-methyl-1H-pyrazole-3-carboxamide
TypeSmall organic molecule
Emp. Form.C39H58Cl3N5O
Mol. Mass.719.27
SMILESCc1c(nn(c1-c1ccc(Cl)cc1)-c1ccc(Cl)cc1Cl)C(=O)NCCCCCCCCCCCNCCCCCCCCCCCN