Reaction Details
TargetCannabinoid receptor 1
LigandBDBM50328957
Substrate/Competitorn/a
Meas. Tech.ChEMBL_674008 (CHEMBL1275185)
Ki 5.44±n/a nM
Citation Zhang, YGilliam, AMaitra, RDamaj, MITajuba, JMSeltzman, HHThomas, BF Synthesis and biological evaluation of bivalent ligands for the cannabinoid 1 receptor. J Med Chem53:7048-60 (2010) 
 
Cannabinoid receptor 1
Name:Cannabinoid receptor 1
Type:G Protein-Coupled Receptor (GPCR)
Mol. Mass.:52868.96
Organism:Homo sapiens (Human)
Description:P21554
Residue:472
BDBM50328957
NameBDBM50328957
Synonyms:CHEMBL1269773 | N-{9-[(9-Aminononyl)amino]nonyl}-5-(4-chlorophenyl)-1-(2,4-dichlorophenyl)-4-methyl-1H-pyrazole-3-carboxamide
TypeSmall organic molecule
Emp. Form.C35H50Cl3N5O
Mol. Mass.663.163
SMILESCc1c(nn(c1-c1ccc(Cl)cc1)-c1ccc(Cl)cc1Cl)C(=O)NCCCCCCCCCNCCCCCCCCCN