Reaction Details
TargetCannabinoid receptor 1
LigandBDBM50328951
Substrate/Competitorn/a
Meas. Tech.ChEMBL_674008 (CHEMBL1275185)
Ki 57.4±n/a nM
Citation Zhang, YGilliam, AMaitra, RDamaj, MITajuba, JMSeltzman, HHThomas, BF Synthesis and biological evaluation of bivalent ligands for the cannabinoid 1 receptor. J Med Chem53:7048-60 (2010) 
 
Cannabinoid receptor 1
Name:Cannabinoid receptor 1
Type:G Protein-Coupled Receptor (GPCR)
Mol. Mass.:52868.96
Organism:Homo sapiens (Human)
Description:P21554
Residue:472
BDBM50328951
NameBDBM50328951
Synonyms:CHEMBL1269767 | N,N'-(Iminodinonane-9,1-diyl)bis[5-(4-chlorophenyl)-1-(2,4-dichlorophenyl)-4-methyl-1H-pyrazole-3-carboxamide]
TypeSmall organic molecule
Emp. Form.C52H59Cl6N7O2
Mol. Mass.1026.789
SMILESCc1c(nn(c1-c1ccc(Cl)cc1)-c1ccc(Cl)cc1Cl)C(=O)NCCCCCCCCCNCCCCCCCCCNC(=O)c1nn(c(c1C)-c1ccc(Cl)cc1)-c1ccc(Cl)cc1Cl