Reaction Details
TargetSubstance-P receptor
LigandBDBM50328971
Substrate/Competitorn/a
Meas. Tech.ChEMBL_674023 (CHEMBL1275200)
Ki 0.35±n/a nM
Citation Xiao, DWang, CPalani, ATsui, HCReichard, GPaliwal, SShih, NYAslanian, RDuffy, RLachowicz, JVarty, GMorgan, CLiu, FNomeir, A Discovery of a series of potent, orally activea,a-disubstituted piperidine NK(1) antagonists. Bioorg Med Chem Lett20:6313-5 (2010) 
 
Substance-P receptor
Name:Substance-P receptor
Type:G Protein-Coupled Receptor (GPCR)
Mol. Mass.:46254.43
Organism:Homo sapiens (Human)
Description:P25103
Residue:407
BDBM50328971
NameBDBM50328971
Synonyms:CHEMBL1270067 | N-((3R,6S)-6-(((R)-1-(3,5-bis(trifluoromethyl)phenyl)ethoxy)methyl)-6-phenylpiperidin-3-yl)acetamide
TypeSmall organic molecule
Emp. Form.C24H26F6N2O2
Mol. Mass.488.4659
SMILESC[C@@H](OC[C@]1(CC[C@H](CN1)NC(C)=O)c1ccccc1)c1cc(cc(c1)C(F)(F)F)C(F)(F)F