Reaction Details
TargetSubstance-P receptor
LigandBDBM50328975
Substrate/Competitorn/a
Meas. Tech.ChEMBL_674023 (CHEMBL1275200)
Ki 0.69±n/a nM
Citation Xiao, DWang, CPalani, ATsui, HCReichard, GPaliwal, SShih, NYAslanian, RDuffy, RLachowicz, JVarty, GMorgan, CLiu, FNomeir, A Discovery of a series of potent, orally activea,a-disubstituted piperidine NK(1) antagonists. Bioorg Med Chem Lett20:6313-5 (2010) 
 
Substance-P receptor
Name:Substance-P receptor
Type:G Protein-Coupled Receptor (GPCR)
Mol. Mass.:46254.43
Organism:Homo sapiens (Human)
Description:P25103
Residue:407
BDBM50328975
NameBDBM50328975
Synonyms:1-((3S,6S)-6-(((R)-1-(3,5-bis(trifluoromethyl)phenyl)ethoxy)methyl)-6-phenylpiperidin-3-yl)urea | CHEMBL1270272
TypeSmall organic molecule
Emp. Form.C23H25F6N3O2
Mol. Mass.489.4539
SMILESC[C@@H](OC[C@]1(CC[C@@H](CN1)NC(N)=O)c1ccccc1)c1cc(cc(c1)C(F)(F)F)C(F)(F)F