Reaction Details
TargetSubstance-P receptor
LigandBDBM50328984
Substrate/Competitorn/a
Meas. Tech.ChEMBL_674023 (CHEMBL1275200)
Ki 0.37±n/a nM
Citation Xiao, DWang, CPalani, ATsui, HCReichard, GPaliwal, SShih, NYAslanian, RDuffy, RLachowicz, JVarty, GMorgan, CLiu, FNomeir, A Discovery of a series of potent, orally activea,a-disubstituted piperidine NK(1) antagonists. Bioorg Med Chem Lett20:6313-5 (2010) 
 
Substance-P receptor
Name:Substance-P receptor
Type:G Protein-Coupled Receptor (GPCR)
Mol. Mass.:46254.43
Organism:Homo sapiens (Human)
Description:P25103
Residue:407
BDBM50328984
NameBDBM50328984
Synonyms:(3S,6S)-6-(((R)-1-(3,5-bis(trifluoromethyl)phenyl)ethoxy)methyl)-N-ethyl-6-phenylpiperidine-3-carboxamide | CHEMBL1270766
TypeSmall organic molecule
Emp. Form.C25H28F6N2O2
Mol. Mass.502.4924
SMILESCCNC(=O)[C@H]1CC[C@](CO[C@H](C)c2cc(cc(c2)C(F)(F)F)C(F)(F)F)(NC1)c1ccccc1