Reaction Details
TargetSubstance-P receptor
LigandBDBM50328986
Substrate/Competitorn/a
Meas. Tech.ChEMBL_674023 (CHEMBL1275200)
Ki 0.34±n/a nM
Citation Xiao, DWang, CPalani, ATsui, HCReichard, GPaliwal, SShih, NYAslanian, RDuffy, RLachowicz, JVarty, GMorgan, CLiu, FNomeir, A Discovery of a series of potent, orally activea,a-disubstituted piperidine NK(1) antagonists. Bioorg Med Chem Lett20:6313-5 (2010) 
 
Substance-P receptor
Name:Substance-P receptor
Type:G Protein-Coupled Receptor (GPCR)
Mol. Mass.:46254.43
Organism:Homo sapiens (Human)
Description:P25103
Residue:407
BDBM50328986
NameBDBM50328986
Synonyms:(3S,6S)-6-(((R)-1-(3,5-bis(trifluoromethyl)phenyl)ethoxy)methyl)-N-cyclopropyl-6-phenylpiperidine-3-carboxamide | CHEMBL1270868
TypeSmall organic molecule
Emp. Form.C26H28F6N2O2
Mol. Mass.514.5031
SMILESC[C@@H](OC[C@]1(CC[C@@H](CN1)C(=O)NC1CC1)c1ccccc1)c1cc(cc(c1)C(F)(F)F)C(F)(F)F