Reaction Details
TargetRenin
LigandBDBM50329024
Substrate/Competitorn/a
Meas. Tech.ChEMBL_674153 (CHEMBL1274250)
IC50 34±n/a nM
Citation Scheiper, BMatter, HSteinhagen, HStilz, UBöcskei, ZFleury, VMcCort, G Discovery and optimization of a new class of potent and non-chiral indole-3-carboxamide-based renin inhibitors. Bioorg Med Chem Lett20:6268-72 (2010) 
 
Renin
Name:Renin
Type:Enzyme
Mol. Mass.:45058.99
Organism:Homo sapiens (Human)
Description:n/a
Residue:406
BDBM50329024
NameBDBM50329024
Synonyms:(1-cyclohexyl-2-(3-fluoro-2-methylbenzyl)-1H-indol-3-yl)(piperazin-1-yl)methanone | CHEMBL1271184
TypeSmall organic molecule
Emp. Form.C27H32FN3O
Mol. Mass.433.5609
SMILESCc1c(F)cccc1Cc1c(C(=O)N2CCNCC2)c2ccccc2n1C1CCCCC1