Reaction Details
TargetRenin
LigandBDBM50329043
Substrate/Competitorn/a
Meas. Tech.ChEMBL_674153 (CHEMBL1274250)
IC50 5±n/a nM
Citation Scheiper, BMatter, HSteinhagen, HStilz, UBöcskei, ZFleury, VMcCort, G Discovery and optimization of a new class of potent and non-chiral indole-3-carboxamide-based renin inhibitors. Bioorg Med Chem Lett20:6268-72 (2010) 
 
Renin
Name:Renin
Type:Enzyme
Mol. Mass.:45058.99
Organism:Homo sapiens (Human)
Description:n/a
Residue:406
BDBM50329043
NameBDBM50329043
Synonyms:(2-(5-fluoro-2-methylphenoxy)-1-phenyl-1H-indol-3-yl)(piperazin-1-yl)methanone | CHEMBL1270375
TypeSmall organic molecule
Emp. Form.C26H24FN3O2
Mol. Mass.429.4861
SMILESCc1ccc(F)cc1Oc1c(C(=O)N2CCNCC2)c2ccccc2n1-c1ccccc1