Reaction Details
TargetEphrin type-B receptor 4
LigandBDBM50329059
Substrate/Competitorn/a
Meas. Tech.ChEMBL_674154 (CHEMBL1274251)
IC50 61±n/a nM
Citation Bardelle, CBarlaam, BBrooks, NColeman, TCross, DDucray, RGreen, IBrempt, CLOlivier, ARead, J Inhibitors of the tyrosine kinase EphB4. Part 3: identification of non-benzodioxole-based kinase inhibitors. Bioorg Med Chem Lett20:6242-5 (2010) 
 
Ephrin type-B receptor 4
Name:Ephrin type-B receptor 4
Type:Enzyme
Mol. Mass.:108273.51
Organism:Homo sapiens (Human)
Description:P54760
Residue:987
BDBM50329059
NameBDBM50329059
Synonyms:CHEMBL1236772 N4-(1H-indazol-4-yl)-N2-(3-(methylsulfonyl)phenyl)pyrimidine-2,4-diamine | N^4^-1H-INDAZOL-4-YL-N^2^-[3-(METHYLSULFONYL)PHENYL]PYRIMIDINE-2,4-DIAMINE
TypeSmall organic molecule
Emp. Form.C18H16N6O2S
Mol. Mass.380.424
SMILESCS(=O)(=O)c1cccc(Nc2nccc(Nc3cccc4[nH]ncc34)n2)c1