Reaction Details
TargetEphrin type-B receptor 4
LigandBDBM50329060
Substrate/Competitorn/a
Meas. Tech.ChEMBL_674154 (CHEMBL1274251)
IC50 913±n/a nM
Citation Bardelle, CBarlaam, BBrooks, NColeman, TCross, DDucray, RGreen, IBrempt, CLOlivier, ARead, J Inhibitors of the tyrosine kinase EphB4. Part 3: identification of non-benzodioxole-based kinase inhibitors. Bioorg Med Chem Lett20:6242-5 (2010) 
 
Ephrin type-B receptor 4
Name:Ephrin type-B receptor 4
Type:Enzyme
Mol. Mass.:108273.51
Organism:Homo sapiens (Human)
Description:P54760
Residue:987
BDBM50329060
NameBDBM50329060
Synonyms:CHEMBL1270975 | N4-(3-chloro-1H-indol-7-yl)-N2-(3-(methylsulfonyl)phenyl)pyrimidine-2,4-diamine
TypeSmall organic molecule
Emp. Form.C19H16ClN5O2S
Mol. Mass.413.881
SMILESCS(=O)(=O)c1cccc(Nc2nccc(Nc3cccc4c(Cl)c[nH]c34)n2)c1