Reaction Details
TargetEphrin type-B receptor 4
LigandBDBM50329067
Substrate/Competitorn/a
Meas. Tech.ChEMBL_674154 (CHEMBL1274251)
IC50 117±n/a nM
Citation Bardelle, CBarlaam, BBrooks, NColeman, TCross, DDucray, RGreen, IBrempt, CLOlivier, ARead, J Inhibitors of the tyrosine kinase EphB4. Part 3: identification of non-benzodioxole-based kinase inhibitors. Bioorg Med Chem Lett20:6242-5 (2010) 
 
Ephrin type-B receptor 4
Name:Ephrin type-B receptor 4
Type:Enzyme
Mol. Mass.:108273.51
Organism:Homo sapiens (Human)
Description:P54760
Residue:987
BDBM50329067
NameBDBM50329067
Synonyms:CHEMBL1271288 | N2-(3,5-dimorpholinophenyl)-N4-(1H-indol-4-yl)pyrimidine-2,4-diamine
TypeSmall organic molecule
Emp. Form.C26H29N7O2
Mol. Mass.471.5542
SMILESC1CN(CCO1)c1cc(Nc2nccc(Nc3cccc4[nH]ccc34)n2)cc(c1)N1CCOCC1