Reaction Details
TargetEphrin type-B receptor 4
LigandBDBM50329072
Substrate/Competitorn/a
Meas. Tech.ChEMBL_674154 (CHEMBL1274251)
IC50 21±n/a nM
Citation Bardelle, CBarlaam, BBrooks, NColeman, TCross, DDucray, RGreen, IBrempt, CLOlivier, ARead, J Inhibitors of the tyrosine kinase EphB4. Part 3: identification of non-benzodioxole-based kinase inhibitors. Bioorg Med Chem Lett20:6242-5 (2010) 
 
Ephrin type-B receptor 4
Name:Ephrin type-B receptor 4
Type:Enzyme
Mol. Mass.:108273.51
Organism:Homo sapiens (Human)
Description:P54760
Residue:987
BDBM50329072
NameBDBM50329072
Synonyms:(3-(4-((1H-indazol-4-yl)(methyl)amino)pyrimidin-2-ylamino)phenyl)methanol | CHEMBL1269964
TypeSmall organic molecule
Emp. Form.C19H18N6O
Mol. Mass.346.3858
SMILESCN(c1ccnc(Nc2cccc(CO)c2)n1)c1cccc2[nH]ncc12