Reaction Details
TargetEphrin type-B receptor 4
LigandBDBM50329073
Substrate/Competitorn/a
Meas. Tech.ChEMBL_674154 (CHEMBL1274251)
IC50 246±n/a nM
Citation Bardelle, CBarlaam, BBrooks, NColeman, TCross, DDucray, RGreen, IBrempt, CLOlivier, ARead, J Inhibitors of the tyrosine kinase EphB4. Part 3: identification of non-benzodioxole-based kinase inhibitors. Bioorg Med Chem Lett20:6242-5 (2010) 
 
Ephrin type-B receptor 4
Name:Ephrin type-B receptor 4
Type:Enzyme
Mol. Mass.:108273.51
Organism:Homo sapiens (Human)
Description:P54760
Residue:987
BDBM50329073
NameBDBM50329073
Synonyms:3-(4-(1H-indazol-4-ylamino)pyrimidin-2-ylamino)-N,N-dimethylbenzamide | CHEMBL1269965
TypeSmall organic molecule
Emp. Form.C20H19N7O
Mol. Mass.373.4112
SMILESCN(C)C(=O)c1cccc(Nc2nccc(Nc3cccc4[nH]ncc34)n2)c1